{"text_format":"1","workbook":"xlsx","n_sheets":12,"sheets":["Instructions - Start Here","Is 131 the Best Option","131 Program Summary","Credits","Curriculum Development","Salaries & Wages","Salaries & Wages - old","Tuition Remission","Sub-Agreements","Supplies & Services","Investing the Margin","Validation"],"not_rendered":{"charts":1,"images":0,"macros":1,"external_links":2,"defined_names":4,"comments":0,"pivot_tables":0},"unopened":[],"bounds":{"document_bytes":16777216,"sheet_cells":100000,"rows_first":2000,"rows_last":500,"rows_between":2000,"halvings":0,"cell_chars":16384,"cell_head_chars":4096},"cells_cut":0,"cells_raw":0,"read":"whole","date_system":"1900"}

{"sheet":"Instructions - Start Here","index":0,"n_rows":22,"n_cols":2,"rows_kept":22,"cut":false,"hidden":false,"merged":[]}
[null,"Instructions"]
[]
[null,"Step 1 - Use the \"Is 131 the Best Option?\" tab to determine whether a 131 is best for you."]
[null,"Goal: Determine whether a program should be a 131 program. 131 programs result in net new enrollment and revenue growth to campus. They must be self-supporting instructional programs that have not been budgeted through UW-Extension and are outside the tuition pool, and they must not compete with, or draw student away from, existing programs. Examples of these non-pooled programs include professional master’s and capstone certificate programs.\n\nHow to use:\nFill out the Yes/No column with the appropriate answer to each question. The result will appear in the Result box below. Read the information to the right. If your result is a 131 program, continue filling out the subsequent tabs of the workbook. If not, a 101 program is likely preferred, so the workbook is no longer relevant."]
[null,"Step 2 - If yes, fill out green boxes on all subsequent tabs."]
[null,"131 Program Summary\n       "]
{"$rows_left_out":17}
{"sheet":"Is 131 the Best Option","index":1,"n_rows":12,"n_cols":7,"rows_kept":12,"cut":false,"hidden":false,"merged":[[0,1,0,3],[1,1,1,2]]}
[null,"Is 131 the Best Option?"]
[null,"Characteristic",null,"Yes/No"]
[null,1,"Is the program designed for non-traditional students through modality, curriculum, and attentiveness to workforce demand?","yes"]
[null,2,"Does the program have substantial opportunity for scale (e.g. more than 750 incremental annual credits)?","yes","Yes"]
[null,3,"Does the program have substantial opportunity for differentiated market tuition (e.g. above the standard grad rate in your school /college)?","No","No"]
[null,{"$f":"CONCATENATE(3,\".\")","v":"3."},"Does the cost of instruction and support of the program leave room for substantial investment margin?"]
{"$rows_left_out":7}
{"sheet":"131 Program Summary","index":2,"n_rows":93,"n_cols":13,"rows_kept":93,"cut":false,"hidden":false,"merged":[[54,1,54,11]]}
[1,"Program name",null,null,"Program department"]
[{"$f":"A1+1","v":2}]
[{"$f":"A2+1","v":3},"Investment start (Academic Year)",2020,null,"Program duration (years - Full Time)",1]
[4,"Enrollment start (Academic Year)",2021,null,"Program duration (years - Part Time)",2]
[5]
[6,"Resident price per credit",1200,null,"School / college share approach","Net Revenue"]
{"$rows_left_out":88}
{"sheet":"Credits","index":3,"n_rows":87,"n_cols":25,"rows_kept":87,"cut":false,"hidden":false,"merged":[[1,3,1,4],[11,15,11,24],[11,3,11,12],[13,1,14,1]]}
[1,null,"Instructions: Enter credits and Enrollment Total in each green box"]
[{"$f":"A1+1","v":2},null,null,"Credit Load"]
[{"$f":"A2+1","v":3},null,null,"Full time","Part-time"]
[4,null,"Year 1 -->",30,15,"<-- Year 1"]
[5,null,{"$f":"IF('131 Program Summary'!$F$3>1, \"Year 2 -->\",\"\")","v":""},null,15,{"$f":"IF('131 Program Summary'!$F$4>1, \"<-- Year 2\",\"\")","v":"<-- Year 2"}]
[6,null,{"$f":"IF('131 Program Summary'!$F$3>2, \"Year 3 -->\",\"\")","v":""},null,null,{"$f":"IF('131 Program Summary'!$F$4>2, \"<-- Year 3\",\"\")","v":""}]
{"$rows_left_out":82}
{"sheet":"Curriculum Development","index":4,"n_rows":30,"n_cols":14,"rows_kept":30,"cut":false,"hidden":false,"merged":[[0,0,0,3],[18,0,18,3]]}
["Worksheet for Curriculum",null,null,null,{"$f":"'131 Program Summary'!C22","v":2020},{"$f":"'131 Program Summary'!D22","v":2021},{"$f":"'131 Program Summary'!E22","v":2022},{"$f":"'131 Program Summary'!F22","v":2023},{"$f":"'131 Program Summary'!G22","v":2024},{"$f":"'131 Program Summary'!H22","v":2025},{"$f":"'131 Program Summary'!I22","v":2026},{"$f":"'131 Program Summary'!J22","v":2027},{"$f":"'131 Program Summary'!K22","v":2028},{"$f":"'131 Program Summary'!L22","v":2029}]
["Course name","Credits","Type","Year of Development",{"$f":"CONCATENATE(E1,\"              \",\"Development Cost (standard $30,000, transition $15,000, and 15% maintenance)\")","v":"2020              Development Cost (standard $30,000, transition $15,000, and 15% maintenance)"},{"$f":"CONCATENATE(F1,\"              \",\"Development Cost (standard $30,000, transition $15,000, and 15% maintenance)\")","v":"2021              Development Cost (standard $30,000, transition $15,000, and 15% maintenance)"},"2022              Development Cost (standard $30,000, transition $15,000, and 15% maintenance)","2023              Development Cost (standard $30,000, transition $15,000, and 15% maintenance)","2024              Development Cost (standard $30,000, transition $15,000, and 15% maintenance)","2025              Development Cost (standard $30,000, transition $15,000, and 15% maintenance)","2026              Development Cost (standard $30,000, transition $15,000, and 15% maintenance)","2027              Development Cost (standard $30,000, transition $15,000, and 15% maintenance)","2028              Development Cost (standard $30,000, transition $15,000, and 15% maintenance)","2029              Development Cost (standard $30,000, transition $15,000, and 15% maintenance)"]
[]
["Course 1",null,"Transition",2020,{"$f":"IF(ISBLANK($A4),\"\",IF(E$1<$D4,\"\",IF(E$1>$D4,30000*0.15,IF($C4=\"Maintenance\",30000*0.15,IF($C4=\"New\",30000,15000)))))","v":15000},{"$f":"IF(ISBLANK($A4),\"\",IF(F$1<$D4,\"\",IF(F$1>$D4,30000*0.15,IF($C4=\"Maintenance\",30000*0.15,IF($C4=\"New\",30000,15000)))))","v":4500},4500,4500,4500,4500,4500,4500,4500,4500]
[null,null,null,null,{"$f":"IF(ISBLANK($A5),\"\",IF(E$1<$D5,\"\",IF(E$1>$D5,30000*0.15,IF($C5=\"Maintenance\",30000*0.15,IF($C5=\"New\",30000,15000)))))","v":""},"","","","","","","","",""]
[null,null,null,null,{"$f":"IF(ISBLANK($A6),\"\",IF(E$1<$D6,\"\",IF(E$1>$D6,30000*0.15,IF($C6=\"Maintenance\",30000*0.15,IF($C6=\"New\",30000,15000)))))","v":""},"","","","","","","","",""]
{"$rows_left_out":25}
{"sheet":"Salaries & Wages","index":5,"n_rows":52,"n_cols":50,"rows_kept":52,"cut":false,"hidden":false,"merged":[[1,46,1,49],[38,12,41,14],[1,26,1,29],[1,30,1,33],[1,34,1,37],[1,38,1,41],[1,42,1,45],[1,18,1,21],[1,22,1,25],[0,0,0,2],[27,0,28,15],[43,1,43,2],[1,10,1,13],[1,14,1,17]]}
["Worksheet for Salaries & Wages"]
[null,"Note: Open + for each year to fill in additional data",null,null,null,null,null,null,null,null,{"$f":"'131 Program Summary'!C22","v":2020},null,null,null,{"$f":"'131 Program Summary'!D22","v":2021},null,null,null,{"$f":"'131 Program Summary'!E22","v":2022},null,null,null,{"$f":"'131 Program Summary'!F22","v":2023},null,null,null,{"$f":"'131 Program Summary'!G22","v":2024},null,null,null,{"$f":"'131 Program Summary'!H22","v":2025},null,null,null,{"$f":"'131 Program Summary'!I22","v":2026},null,null,null,{"$f":"'131 Program Summary'!J22","v":2027},null,null,null,{"$f":"'131 Program Summary'!K22","v":2028},null,null,null,{"$f":"'131 Program Summary'!L22","v":2029}]
["Name","Title","Type","Employee Type","Role Description (free form)","Salary / Wage","Pay Basis","Fringe Rate","Compensation Escalator",null,"Months","Effort","Requested Salary","Total Cost","Months","Effort","Requested Salary","Total Cost","Months","Effort","Requested Salary","Total Cost","Months","Effort","Requested Salary","Total Cost","Months","Effort","Requested Salary","Total Cost","Months","Effort","Requested Salary","Total Cost","Months","Effort","Requested Salary","Total Cost","Months","Effort","Requested Salary","Total Cost","Months","Effort","Requested Salary","Total Cost","Months","Effort","Requested Salary","Total Cost"]
[]
[null,null,"Program Development - Startup (DCS / Campus)","Faculty / Academic Staff",null,null,"Annual (A basis)",{"$f":"IFERROR(VLOOKUP($D5,$B$45:$C$48,2),\"\")","v":0.33329999999999999},"2%",null,12,1,{"$f":"ROUND((IF($G5=\"Hourly (H basis)\",$F5,($F5/IF($G5=\"Annual (A basis)\",12,9)*K5*L5))),0)","v":0},{"$f":"SUMPRODUCT(M5,1+$H5)","v":0},12,1,{"$f":"ROUND((IF($G5=\"Hourly (H basis)\",$F5,($F5/IF($G5=\"Annual (A basis)\",12,9)*O5*P5))),0)","v":0},{"$f":"SUMPRODUCT(Q5,1+$H5)*(1+$I5^1)","v":0},12,1,{"$f":"ROUND((IF($G5=\"Hourly (H basis)\",$F5,($F5/IF($G5=\"Annual (A basis)\",12,9)*S5*T5))),0)","v":0},{"$f":"SUMPRODUCT(U5,1+$H5)*((1+$I5)^2)","v":0},12,1,{"$f":"ROUND((IF($G5=\"Hourly (H basis)\",$F5,($F5/IF($G5=\"Annual (A basis)\",12,9)*W5*X5))),0)","v":0},{"$f":"SUMPRODUCT(Y5,1+$H5)*((1+$I5)^3)","v":0},12,1,{"$f":"ROUND((IF($G5=\"Hourly (H basis)\",$F5,($F5/IF($G5=\"Annual (A basis)\",12,9)*AA5*AB5))),0)","v":0},{"$f":"SUMPRODUCT(AC5,1+$H5)*((1+$I5)^4)","v":0},12,1,{"$f":"ROUND((IF($G5=\"Hourly (H basis)\",$F5,($F5/IF($G5=\"Annual (A basis)\",12,9)*AE5*AF5))),0)","v":0},{"$f":"SUMPRODUCT(AG5,1+$H5)*((1+$I5)^5)","v":0},12,1,{"$f":"ROUND((IF($G5=\"Hourly (H basis)\",$F5,($F5/IF($G5=\"Annual (A basis)\",12,9)*AI5*AJ5))),0)","v":0},{"$f":"SUMPRODUCT(AK5,1+$H5)*((1+$I5)^6)","v":0},12,1,{"$f":"ROUND((IF($G5=\"Hourly (H basis)\",$F5,($F5/IF($G5=\"Annual (A basis)\",12,9)*AM5*AN5))),0)","v":0},{"$f":"SUMPRODUCT(AO5,1+$H5)*((1+$I5)^7)","v":0},12,1,{"$f":"ROUND((IF($G5=\"Hourly (H basis)\",$F5,($F5/IF($G5=\"Annual (A basis)\",12,9)*AQ5*AR5))),0)","v":0},{"$f":"SUMPRODUCT(AS5,1+$H5)*((1+$I5)^8)","v":0},12,1,{"$f":"ROUND((IF($G5=\"Hourly (H basis)\",$F5,($F5/IF($G5=\"Annual (A basis)\",12,9)*AU5*AV5))),0)","v":0},{"$f":"SUMPRODUCT(AW5,1+$H5)*((1+$I5)^9)","v":0}]
[null,null,"Program Marketing","Faculty / Academic Staff",null,null,"Annual (A basis)",{"$f":"IFERROR(VLOOKUP($D6,$B$45:$C$48,2),\"\")","v":0.33329999999999999},"2%",null,12,1,{"$f":"ROUND((IF($G6=\"Hourly (H basis)\",$F6,($F6/IF($G6=\"Annual (A basis)\",12,9)*K6*L6))),0)","v":0},{"$f":"SUMPRODUCT(M6,1+$H6)","v":0},12,1,{"$f":"ROUND((IF($G6=\"Hourly (H basis)\",$F6,($F6/IF($G6=\"Annual (A basis)\",12,9)*O6*P6))),0)","v":0},{"$f":"SUMPRODUCT(Q6,1+$H6)*(1+$I6^1)","v":0},12,1,{"$f":"ROUND((IF($G6=\"Hourly (H basis)\",$F6,($F6/IF($G6=\"Annual (A basis)\",12,9)*S6*T6))),0)","v":0},{"$f":"SUMPRODUCT(U6,1+$H6)*((1+$I6)^2)","v":0},12,1,{"$f":"ROUND((IF($G6=\"Hourly (H basis)\",$F6,($F6/IF($G6=\"Annual (A basis)\",12,9)*W6*X6))),0)","v":0},{"$f":"SUMPRODUCT(Y6,1+$H6)*((1+$I6)^3)","v":0},12,1,{"$f":"ROUND((IF($G6=\"Hourly (H basis)\",$F6,($F6/IF($G6=\"Annual (A basis)\",12,9)*AA6*AB6))),0)","v":0},{"$f":"SUMPRODUCT(AC6,1+$H6)*((1+$I6)^4)","v":0},12,1,{"$f":"ROUND((IF($G6=\"Hourly (H basis)\",$F6,($F6/IF($G6=\"Annual (A basis)\",12,9)*AE6*AF6))),0)","v":0},{"$f":"SUMPRODUCT(AG6,1+$H6)*((1+$I6)^5)","v":0},12,1,{"$f":"ROUND((IF($G6=\"Hourly (H basis)\",$F6,($F6/IF($G6=\"Annual (A basis)\",12,9)*AI6*AJ6))),0)","v":0},{"$f":"SUMPRODUCT(AK6,1+$H6)*((1+$I6)^6)","v":0},12,1,{"$f":"ROUND((IF($G6=\"Hourly (H basis)\",$F6,($F6/IF($G6=\"Annual (A basis)\",12,9)*AM6*AN6))),0)","v":0},{"$f":"SUMPRODUCT(AO6,1+$H6)*((1+$I6)^7)","v":0},12,1,{"$f":"ROUND((IF($G6=\"Hourly (H basis)\",$F6,($F6/IF($G6=\"Annual (A basis)\",12,9)*AQ6*AR6))),0)","v":0},{"$f":"SUMPRODUCT(AS6,1+$H6)*((1+$I6)^8)","v":0},12,1,{"$f":"ROUND((IF($G6=\"Hourly (H basis)\",$F6,($F6/IF($G6=\"Annual (A basis)\",12,9)*AU6*AV6))),0)","v":0},{"$f":"SUMPRODUCT(AW6,1+$H6)*((1+$I6)^9)","v":0}]
{"$rows_left_out":47}
{"sheet":"Salaries & Wages - old","index":6,"n_rows":47,"n_cols":87,"rows_kept":47,"cut":false,"hidden":true,"merged":[[0,0,0,2],[43,1,43,2],[27,0,28,10]]}
["Worksheet for Salaries & Wages"]
[null,"Note: Open + for each year to fill in additional data"]
["Name","Title","Type","Employee Type","Role Description (free form)",{"$f":"'131 Program Summary'!C22","v":2020},"Pay Basis","Months","Effort","Requested Salary","Fringe Rate","Fringe Benefit","Total Cost",{"$f":"'131 Program Summary'!D22","v":2021},"Pay Basis","Months","Effort","Requested Salary","Fringe Rate","Fringe Benefit","Total Cost",{"$f":"'131 Program Summary'!E22","v":2022},"Pay Basis","Months","Effort","Requested Salary","Fringe Rate","Fringe Benefit","Total Cost",{"$f":"'131 Program Summary'!F22","v":2023},"Pay Basis","Months","Effort","Requested Salary","Fringe Rate","Fringe Benefit","Total Cost",{"$f":"'131 Program Summary'!G22","v":2024},"Pay Basis","Months","Effort","Requested Salary","Fringe Rate","Fringe Benefit","Total Cost",{"$f":"'131 Program Summary'!H22","v":2025},"Pay Basis","Months","Effort","Requested Salary","Fringe Rate","Fringe Benefit","Total Cost",{"$f":"'131 Program Summary'!I22","v":2026},"Pay Basis","Months","Effort","Requested Salary","Fringe Rate","Fringe Benefit","Total Cost",{"$f":"'131 Program Summary'!J22","v":2027},"Pay Basis","Months","Effort","Requested Salary","Fringe Rate","Fringe Benefit","Total Cost",{"$f":"'131 Program Summary'!K22","v":2028},"Pay Basis","Months","Effort","Requested Salary","Fringe Rate","Fringe Benefit","Total Cost",{"$f":"'131 Program Summary'!L22","v":2029},"Pay Basis","Months","Effort","Requested Salary","Fringe Rate","Fringe Benefit","Total Cost"]
[]
["TBN","Faculty","Program Development - Startup (DCS / Campus)","Faculty / Academic Staff",null,100000,"Annual (A basis)",12,1,{"$f":"ROUND((IF(G5=\"Hourly (H basis)\",F5,(F5/IF(G5=\"Annual (A basis)\",12,9)*H5*I5))),0)","v":100000},{"$f":"IFERROR(VLOOKUP($D5,$B$45:$C$47,2),\"\")","v":0.38700000000000001},{"$f":"IFERROR(ROUND((K5*J5),0),\"\")","v":38700},{"$f":"SUM(J5,L5)","v":138700},100000,"Annual (A basis)",12,1,{"$f":"ROUND((IF(O5=\"Hourly (H basis)\",N5,(N5/IF(O5=\"Annual (A basis)\",12,9)*P5*Q5))),0)","v":100000},{"$f":"IFERROR(VLOOKUP($D5,$B$45:$C$47,2),\"\")","v":0.38700000000000001},{"$f":"IFERROR(ROUND((S5*R5),0),\"\")","v":38700},{"$f":"SUM(R5,T5)","v":138700},0,"Annual (A basis)",12,1,{"$f":"ROUND((IF(W5=\"Hourly (H basis)\",V5,(V5/IF(W5=\"Annual (A basis)\",12,9)*X5*Y5))),0)","v":0},{"$f":"IFERROR(VLOOKUP($D5,$B$45:$C$47,2),\"\")","v":0.38700000000000001},{"$f":"IFERROR(ROUND((AA5*Z5),0),\"\")","v":0},{"$f":"SUM(Z5,AB5)","v":0},null,"Annual (A basis)",12,1,{"$f":"ROUND((IF(AE5=\"Hourly (H basis)\",AD5,(AD5/IF(AE5=\"Annual (A basis)\",12,9)*AF5*AG5))),0)","v":0},{"$f":"IFERROR(VLOOKUP($D5,$B$45:$C$47,2),\"\")","v":0.38700000000000001},{"$f":"IFERROR(ROUND((AI5*AH5),0),\"\")","v":0},{"$f":"SUM(AH5,AJ5)","v":0},null,"Annual (A basis)",12,1,{"$f":"ROUND((IF(AM5=\"Hourly (H basis)\",AL5,(AL5/IF(AM5=\"Annual (A basis)\",12,9)*AN5*AO5))),0)","v":0},{"$f":"IFERROR(VLOOKUP($D5,$B$45:$C$47,2),\"\")","v":0.38700000000000001},{"$f":"IFERROR(ROUND((AQ5*AP5),0),\"\")","v":0},{"$f":"SUM(AP5,AR5)","v":0},null,"Annual (A basis)",12,1,{"$f":"ROUND((IF(AU5=\"Hourly (H basis)\",AT5,(AT5/IF(AU5=\"Annual (A basis)\",12,9)*AV5*AW5))),0)","v":0},{"$f":"IFERROR(VLOOKUP($D5,$B$45:$C$47,2),\"\")","v":0.38700000000000001},{"$f":"IFERROR(ROUND((AY5*AX5),0),\"\")","v":0},{"$f":"SUM(AX5,AZ5)","v":0},null,"Annual (A basis)",12,1,{"$f":"ROUND((IF(BC5=\"Hourly (H basis)\",BB5,(BB5/IF(BC5=\"Annual (A basis)\",12,9)*BD5*BE5))),0)","v":0},{"$f":"IFERROR(VLOOKUP($D5,$B$45:$C$47,2),\"\")","v":0.38700000000000001},{"$f":"IFERROR(ROUND((BG5*BF5),0),\"\")","v":0},{"$f":"SUM(BF5,BH5)","v":0},null,"Annual (A basis)",12,1,{"$f":"ROUND((IF(BK5=\"Hourly (H basis)\",BJ5,(BJ5/IF(BK5=\"Annual (A basis)\",12,9)*BL5*BM5))),0)","v":0},{"$f":"IFERROR(VLOOKUP($D5,$B$45:$C$47,2),\"\")","v":0.38700000000000001},{"$f":"IFERROR(ROUND((BO5*BN5),0),\"\")","v":0},{"$f":"SUM(BN5,BP5)","v":0},null,"Annual (A basis)",12,1,{"$f":"ROUND((IF(BS5=\"Hourly (H basis)\",BR5,(BR5/IF(BS5=\"Annual (A basis)\",12,9)*BT5*BU5))),0)","v":0},{"$f":"IFERROR(VLOOKUP($D5,$B$45:$C$47,2),\"\")","v":0.38700000000000001},{"$f":"IFERROR(ROUND((BW5*BV5),0),\"\")","v":0},{"$f":"SUM(BV5,BX5)","v":0},null,"Annual (A basis)",12,1,{"$f":"ROUND((IF(CA5=\"Hourly (H basis)\",BZ5,(BZ5/IF(CA5=\"Annual (A basis)\",12,9)*CB5*CC5))),0)","v":0},{"$f":"IFERROR(VLOOKUP($D5,$B$45:$C$47,2),\"\")","v":0.38700000000000001},{"$f":"IFERROR(ROUND((CE5*CD5),0),\"\")","v":0},{"$f":"SUM(CD5,CF5)","v":0},null,"Request 3 years"]
["TBN","Faculty","Program Development - Startup (DCS / Campus)","Faculty / Academic Staff",null,null,"Annual (A basis)",12,1,0,0.38700000000000001,{"$f":"IFERROR(ROUND((K6*J6),0),\"\")","v":0},{"$f":"SUM(J6,L6)","v":0},100000,"Annual (A basis)",12,1,100000,0.38700000000000001,{"$f":"IFERROR(ROUND((S6*R6),0),\"\")","v":38700},138700,50000,"Annual (A basis)",12,1,50000,0.38700000000000001,{"$f":"IFERROR(ROUND((AA6*Z6),0),\"\")","v":19350},69350,null,"Annual (A basis)",12,1,0,0.38700000000000001,{"$f":"IFERROR(ROUND((AI6*AH6),0),\"\")","v":0},0,null,"Annual (A basis)",12,1,{"$f":"ROUND((IF(AM6=\"Hourly (H basis)\",AL6,(AL6/IF(AM6=\"Annual (A basis)\",12,9)*AN6*AO6))),0)","v":0},0.38700000000000001,{"$f":"IFERROR(ROUND((AQ6*AP6),0),\"\")","v":0},0,null,"Annual (A basis)",12,1,0,0.38700000000000001,{"$f":"IFERROR(ROUND((AY6*AX6),0),\"\")","v":0},0,null,"Annual (A basis)",12,1,0,0.38700000000000001,{"$f":"IFERROR(ROUND((BG6*BF6),0),\"\")","v":0},0,null,"Annual (A basis)",12,1,0,0.38700000000000001,{"$f":"IFERROR(ROUND((BO6*BN6),0),\"\")","v":0},0,null,"Annual (A basis)",12,1,0,0.38700000000000001,{"$f":"IFERROR(ROUND((BW6*BV6),0),\"\")","v":0},0,null,"Annual (A basis)",12,1,0,0.38700000000000001,{"$f":"IFERROR(ROUND((CE6*CD6),0),\"\")","v":0},0,null,"Request 2 years"]
{"$rows_left_out":42}
{"sheet":"Tuition Remission","index":7,"n_rows":12,"n_cols":11,"rows_kept":12,"cut":false,"hidden":false,"merged":[[0,0,0,10],[11,0,13,4]]}
["Worksheet for Project Budget"]
[]
[]
[null,{"$f":"'131 Program Summary'!C22","v":2020},{"$f":"'131 Program Summary'!D22","v":2021},{"$f":"'131 Program Summary'!E22","v":2022},{"$f":"'131 Program Summary'!F22","v":2023},{"$f":"'131 Program Summary'!G22","v":2024},{"$f":"'131 Program Summary'!H22","v":2025},{"$f":"'131 Program Summary'!I22","v":2026},{"$f":"'131 Program Summary'!J22","v":2027},{"$f":"'131 Program Summary'!K22","v":2028},{"$f":"'131 Program Summary'!L22","v":2029}]
["Number of First Semester PA/RA"]
["Sub-Total",{"$f":"ROUND(B5*6000,0)","v":0},{"$f":"ROUND(C5*6000,0)","v":0},0,0,0,0,0,0,0,0]
{"$rows_left_out":7}
{"sheet":"Sub-Agreements","index":8,"n_rows":30,"n_cols":34,"rows_kept":30,"cut":false,"hidden":false,"merged":[[0,1,1,1]]}
[null,"*Note: Default rate for subagreements is $600 per credit hour per student.",null,null,null,null,"Worksheet for Project Budget"]
[]
["Course Name","School / College","Type","Payment Type",{"$f":"CONCATENATE(G3,\" \",\"Payment Amount\",\"*\")","v":"2020 Payment Amount*"},{"$f":"CONCATENATE(G3,\" \",\"Credits\")","v":"2020 Credits"},{"$f":"'131 Program Summary'!C22","v":2020},{"$f":"CONCATENATE(J3,\" \",\"Payment Amount\")","v":"2021 Payment Amount"},{"$f":"CONCATENATE(J3,\" \",\"Credits\")","v":"2021 Credits"},{"$f":"'131 Program Summary'!D22","v":2021},{"$f":"CONCATENATE(M3,\" \",\"Payment Amount\")","v":"2022 Payment Amount"},{"$f":"CONCATENATE(M3,\" \",\"Credits\")","v":"2022 Credits"},{"$f":"'131 Program Summary'!E22","v":2022},{"$f":"CONCATENATE(P3,\" \",\"Payment Amount\")","v":"2023 Payment Amount"},{"$f":"CONCATENATE(P3,\" \",\"Credits\")","v":"2023 Credits"},{"$f":"'131 Program Summary'!F22","v":2023},{"$f":"CONCATENATE(S3,\" \",\"Payment Amount\")","v":"2024 Payment Amount"},{"$f":"CONCATENATE(S3,\" \",\"Credits\")","v":"2024 Credits"},{"$f":"'131 Program Summary'!G22","v":2024},{"$f":"CONCATENATE(V3,\" \",\"Payment Amount\")","v":"2025 Payment Amount"},{"$f":"CONCATENATE(V3,\" \",\"Credits\")","v":"2025 Credits"},{"$f":"'131 Program Summary'!H22","v":2025},{"$f":"CONCATENATE(Y3,\" \",\"Payment Amount\")","v":"2026 Payment Amount"},{"$f":"CONCATENATE(Y3,\" \",\"Credits\")","v":"2026 Credits"},{"$f":"'131 Program Summary'!I22","v":2026},{"$f":"CONCATENATE(AB3,\" \",\"Payment Amount\")","v":"2027 Payment Amount"},{"$f":"CONCATENATE(AB3,\" \",\"Credits\")","v":"2027 Credits"},{"$f":"'131 Program Summary'!J22","v":2027},{"$f":"CONCATENATE(AE3,\" \",\"Payment Amount\")","v":"2028 Payment Amount"},{"$f":"CONCATENATE(AE3,\" \",\"Credits\")","v":"2028 Credits"},{"$f":"'131 Program Summary'!K22","v":2028},{"$f":"CONCATENATE(AH3,\" \",\"Payment Amount\")","v":"2029 Payment Amount"},{"$f":"CONCATENATE(AH3,\" \",\"Credits\")","v":"2029 Credits"},{"$f":"'131 Program Summary'!L22","v":2029}]
[null,"Wisconsin School of Business","Instructional","Per Credit",{"$f":"IF(ISBLANK($A4)=TRUE,\"\",600)","v":""},6,{"$f":"IFERROR(IF($D4=\"Fixed Rate\",E4,E4*F4),\"\")","v":""},{"$f":"IF(ISBLANK($A4)=TRUE,\"\",600)","v":""},6,{"$f":"IFERROR(IF($D4=\"Fixed Rate\",H4,H4*I4),\"\")","v":""},{"$f":"IF(ISBLANK($A4)=TRUE,\"\",600)","v":""},6,{"$f":"IFERROR(IF($D4=\"Fixed Rate\",K4,K4*L4),\"\")","v":""},{"$f":"IF(ISBLANK($A4)=TRUE,\"\",600)","v":""},6,{"$f":"IFERROR(IF($D4=\"Fixed Rate\",N4,N4*O4),\"\")","v":""},{"$f":"IF(ISBLANK($A4)=TRUE,\"\",600)","v":""},6,{"$f":"IFERROR(IF($D4=\"Fixed Rate\",Q4,Q4*R4),\"\")","v":""},{"$f":"IF(ISBLANK($A4)=TRUE,\"\",600)","v":""},6,{"$f":"IFERROR(IF($D4=\"Fixed Rate\",T4,T4*U4),\"\")","v":""},{"$f":"IF(ISBLANK($A4)=TRUE,\"\",600)","v":""},6,{"$f":"IFERROR(IF($D4=\"Fixed Rate\",W4,W4*X4),\"\")","v":""},{"$f":"IF(ISBLANK($A4)=TRUE,\"\",600)","v":""},6,{"$f":"IFERROR(IF($D4=\"Fixed Rate\",Z4,Z4*AA4),\"\")","v":""},{"$f":"IF(ISBLANK($A4)=TRUE,\"\",600)","v":""},6,{"$f":"IFERROR(IF($D4=\"Fixed Rate\",AC4,AC4*AD4),\"\")","v":""},{"$f":"IF(ISBLANK($A4)=TRUE,\"\",600)","v":""},6,{"$f":"IFERROR(IF($D4=\"Fixed Rate\",AF4,AF4*AG4),\"\")","v":""}]
[null,"College of Agricultural and Life Sciences","Instructional","Per Credit","",9,{"$f":"IFERROR(IF($D5=\"Fixed Rate\",E5,E5*F5),\"\")","v":""},"",9,{"$f":"IFERROR(IF($D5=\"Fixed Rate\",H5,H5*I5),\"\")","v":""},"",9,{"$f":"IFERROR(IF($D5=\"Fixed Rate\",K5,K5*L5),\"\")","v":""},"",9,{"$f":"IFERROR(IF($D5=\"Fixed Rate\",N5,N5*O5),\"\")","v":""},"",9,{"$f":"IFERROR(IF($D5=\"Fixed Rate\",Q5,Q5*R5),\"\")","v":""},"",9,{"$f":"IFERROR(IF($D5=\"Fixed Rate\",T5,T5*U5),\"\")","v":""},"",9,{"$f":"IFERROR(IF($D5=\"Fixed Rate\",W5,W5*X5),\"\")","v":""},"",9,{"$f":"IFERROR(IF($D5=\"Fixed Rate\",Z5,Z5*AA5),\"\")","v":""},"",9,{"$f":"IFERROR(IF($D5=\"Fixed Rate\",AC5,AC5*AD5),\"\")","v":""},"",9,{"$f":"IFERROR(IF($D5=\"Fixed Rate\",AF5,AF5*AG5),\"\")","v":""}]
[null,"School of Education","Instructional","Per Credit","",3,{"$f":"IFERROR(IF($D6=\"Fixed Rate\",E6,E6*F6),\"\")","v":""},"",3,"","",3,{"$f":"IFERROR(IF($D6=\"Fixed Rate\",K6,K6*L6),\"\")","v":""},"",3,{"$f":"IFERROR(IF($D6=\"Fixed Rate\",N6,N6*O6),\"\")","v":""},"",3,"","",3,"","",3,"","",3,"","",3,"","",3,""]
{"$rows_left_out":25}
{"sheet":"Supplies & Services","index":9,"n_rows":33,"n_cols":14,"rows_kept":33,"cut":false,"hidden":false,"merged":[]}
[null,null,"Worksheet for Project Budget"]
[]
[]
["Category","Details","Type",{"$f":"'131 Program Summary'!C22","v":2020},{"$f":"'131 Program Summary'!D22","v":2021},{"$f":"'131 Program Summary'!E22","v":2022},{"$f":"'131 Program Summary'!F22","v":2023},{"$f":"'131 Program Summary'!G22","v":2024},{"$f":"'131 Program Summary'!H22","v":2025},{"$f":"'131 Program Summary'!I22","v":2026},{"$f":"'131 Program Summary'!J22","v":2027},{"$f":"'131 Program Summary'!K22","v":2028},{"$f":"'131 Program Summary'!L22","v":2029},"Cumulative"]
["Marketing",null,"Program Marketing",null,null,null,null,null,null,null,null,null,null,{"$f":"SUM(D5:M5)","v":0}]
["Supplies",null,"Program Marketing",null,null,null,null,null,null,null,null,null,null,{"$f":"SUM(D6:M6)","v":0}]
{"$rows_left_out":28}
{"sheet":"Investing the Margin","index":10,"n_rows":90,"n_cols":13,"rows_kept":90,"cut":false,"hidden":false,"merged":[[0,1,0,3]]}
[1,"Worksheet for Investing the Margin"]
[{"$f":"A1+1","v":2},null,"This page should reflect how they will spend the money (in detail). Categories include department salaries, new faculty lines, additional TA positions or scholarships, professional development, and other."]
[{"$f":"A2+1","v":3},null,"The format will be a hybrid of \"Salaries & Wages\" and \"Supplies\""]
[4,null,"The summary categories should show up on the \"131 Program Summary\" "]
[5,"Category","Description",{"$f":"CONCATENATE('131 Program Summary'!C22,\" \",\"Amount\")","v":"2020 Amount"},{"$f":"CONCATENATE('131 Program Summary'!D22,\" \",\"Amount\")","v":"2021 Amount"},{"$f":"CONCATENATE('131 Program Summary'!E22,\" \",\"Amount\")","v":"2022 Amount"},{"$f":"CONCATENATE('131 Program Summary'!F22,\" \",\"Amount\")","v":"2023 Amount"},{"$f":"CONCATENATE('131 Program Summary'!G22,\" \",\"Amount\")","v":"2024 Amount"},{"$f":"CONCATENATE('131 Program Summary'!H22,\" \",\"Amount\")","v":"2025 Amount"},{"$f":"CONCATENATE('131 Program Summary'!I22,\" \",\"Amount\")","v":"2026 Amount"},{"$f":"CONCATENATE('131 Program Summary'!J22,\" \",\"Amount\")","v":"2027 Amount"},{"$f":"CONCATENATE('131 Program Summary'!K22,\" \",\"Amount\")","v":"2028 Amount"},{"$f":"CONCATENATE('131 Program Summary'!L22,\" \",\"Amount\")","v":"2029 Amount"}]
[6]
{"$rows_left_out":85}
{"sheet":"Validation","index":11,"n_rows":12,"n_cols":9,"rows_kept":12,"cut":false,"hidden":false,"merged":[]}
["Type","Supplies","S/C share","Payment Type","Employee Type","Schools","Credit Flow","Years","Course Type"]
["Instructional","Travel","Net Revenue","Fixed Rate","Faculty / Academic Staff","College of Agricultural and Life Sciences","Constant",1,"New"]
["Program Support","Marketing","Margin","Per Credit","RA / PA / TA","Wisconsin School of Business","Variable",2,"Transition"]
["Program Marketing","Meetings",null,null,"Unversity Staff","School of Education",null,3,"Maintenance"]
["Program Development - Startup (DCS / Campus)","Conferences",null,null,null,"College of Engineering",null,4]
["Program Development - Startup","Supplies",null,null,null,"School of Human Ecology",null,5]
{"$rows_left_out":6}